{"text_format":"1","workbook":"xlsx","n_sheets":5,"sheets":["Supplier Survey Instructions","Supplier Qualification Profile","Quality Survey","Quality Survey Score","Sustainability Survey"],"not_rendered":{"charts":1,"images":0,"macros":1,"external_links":0,"defined_names":19,"comments":0,"pivot_tables":0},"unopened":[],"bounds":{"document_bytes":16777216,"sheet_cells":100000,"rows_first":2000,"rows_last":500,"rows_between":2000,"halvings":0,"cell_chars":16384,"cell_head_chars":4096},"cells_cut":0,"cells_raw":0,"read":"whole","date_system":"1900"}

{"sheet":"Supplier Survey Instructions","index":0,"n_rows":1002,"n_cols":26,"rows_kept":1002,"cut":false,"hidden":false,"merged":[[16,0,16,2],[24,0,29,2],[4,0,15,2],[19,0,19,2]]}
["Supplier Survey"]
["SQ04-0005 Rev 37"]
[]
["Instructions"]
["This survey has been provided as part of our supplier qualification process. This information is treated in strict confidence and your cooperation is appreciated. \n\nSuppliers must complete all required fields of the survey in the tabs labeled Supplier Qualification Profile, Quality Survey and Sustainability Survey. Be sure to select the correct supplier type in the Quality Survey tab as some questions and scores are based on these selections.\n\nAll quality survey questions are based on the requirements outlined in SQ02-0020 Skyworks Supplier Quality Manual and SQ03-0337 Supplier Sustainability Specification that is referenced on all purchase orders.  Negative responses to specific questions will require follow up and may preclude further business. Both documents can be downloaded at:"]
[]
[]
[]
[]
[]
[]
[]
[]
[]
[]
[]
["Skyworks External Suppliers Documents to Download (as applicable)"]
[]
[]
["RBA Code of Conduct Link"]
[]
[]
[]
[]
["The tab labeled Quality Survey Score exhibits a chart indicating your overall score as well as each section score. \nThe tab labeled Sustainability Survey shows the overall risk ranking (High or Low) at the top following your successful completion of all required fields."]
[]
[]
[]
[]
[]
[]
[]
[]
[]
[]
[]
[]
[]
[]
[]
{"$rows_left_out":963}
{"sheet":"Supplier Qualification Profile","index":1,"n_rows":774,"n_cols":6,"rows_kept":774,"cut":false,"hidden":false,"merged":[[16,2,17,2],[9,2,10,2],[9,0,10,0],[16,0,17,0]]}
["Supplier Qualification Profile"]
["SQ04-0005 Rev 37"]
[]
["General Information",null,{"$f":"IF(SUM(D7:D63)<>0,\"Items marked with a * require a response\",\"\")","v":"Items marked with a * require a response"}]
["Supplier Type",{"$f":"IF(C5=\"Select Supplier Type on Quality Survey tab\",\"*\",\"\")","v":"*"},{"$f":"IF( 'Quality Survey'!E7=\"Select Supplier Type\",\"Select Supplier Type on Quality Survey tab\",'Quality Survey'!E7)","v":"Select Supplier Type on Quality Survey tab"}]
[]
["Company Name",{"$f":"IF(C7=\"\",\"*\",\"\")","v":"*"},null,{"$f":"IF(B7=\"*\",1,0)","v":1}]
["Parent Company",{"$f":"IF(C8=\"\",\"*\",\"\")","v":"*"},null,{"$f":"IF(B8=\"*\",1,0)","v":1}]
["DUNS Number","*",null,1]
["Address","*",null,1]
[]
["City","*",null,1]
["State","*",null,1]
["Zip","*",null,1]
["Country","*",null,1]
[]
["Remit Address",{"$f":"IF(C17=\"\",\"*\",\"\")","v":"*"},null,{"$f":"IF(B17=\"*\",1,0)","v":1}]
[]
["City",{"$f":"IF(C19=\"\",\"*\",\"\")","v":"*"},null,1]
["State",{"$f":"IF(C20=\"\",\"*\",\"\")","v":"*"},null,1]
["Zip",{"$f":"IF(C21=\"\",\"*\",\"\")","v":"*"},null,1]
["Country",{"$f":"IF(C22=\"\",\"*\",\"\")","v":"*"},null,1]
[]
["President / General Manager",{"$f":"IF(C24=\"\",\"*\",\"\")","v":"*"},null,1]
[]
["Main Phone",{"$f":"IF(C26=\"\",\"*\",\"\")","v":"*"},null,1]
["Main Fax",{"$f":"IF(C27=\"\",\"*\",\"\")","v":"*"},null,1]
["Website",{"$f":"IF(C28=\"\",\"*\",\"\")","v":"*"},null,1]
[]
["Total number of employees",{"$f":"IF(C30=\"\",\"*\",\"\")","v":"*"},null,1]
["Number of production shifts",{"$f":"IF($C$5=\"QMS Training\",\" \",IF(C31=\"\",\"*\",\"\"))","v":"*"},null,1]
["Standard work week","*",null,1]
["Facility size (sq. ft)","*",null,1]
["Facility owned or leased","*",null,1]
["Current capacity utilization","*",null,1]
["Capacity expansion planned? When?","*",null,1]
["Sales - % domestic vs. overseas","*",null,1]
["Do you offer consignment programs","*",null,1]
["% of sales under consignment","*",null,1]
[]
{"$rows_left_out":735}
{"sheet":"Quality Survey","index":2,"n_rows":535,"n_cols":14,"rows_kept":535,"cut":false,"hidden":false,"merged":[[39,1,39,2],[40,1,40,2],[41,1,41,2],[42,1,42,2],[43,1,43,2],[32,1,32,2],[34,1,34,2],[36,1,36,2],[37,1,37,2],[38,1,38,2],[116,1,116,2],[58,1,58,2],[97,1,97,2],[122,1,122,2],[123,1,123,2],[109,1,109,2],[103,1,103,2],[104,1,104,2],[102,1,102,2],[98,1,98,2],[96,1,96,2],[78,1,78,2],[79,1,79,2],[60,1,60,2],[61,1,61,2],[101,1,101,2],[2,2,2,5],[3,2,3,5],[83,1,83,2],[57,1,57,2],[90,1,90,2],[85,1,85,2],[24,1,24,2],[25,1,25,2],[54,1,54,2],[89,1,89,2],[55,1,55,2],[53,1,53,2],[74,1,74,2],[71,1,71,2],[88,1,88,2],[77,1,77,2],[107,1,107,2],[108,1,108,2],[91,1,91,2],[72,1,72,2],[76,1,76,2],[70,1,70,2],[62,1,62,2],[69,1,69,2],[63,1,63,2],[64,1,64,2],[65,1,65,2],[67,1,67,2],[47,1,47,2],[48,1,48,2],[50,1,50,2],[51,1,51,2],[56,1,56,2],[52,1,52,2],[17,1,17,2],[22,1,22,2],[31,1,31,2],[6,4,6,5],[46,1,46,2],[28,1,28,2],[45,1,45,2],[18,1,18,2],[21,1,21,2],[12,1,12,2],[9,1,9,2],[11,1,11,2],[27,1,27,2],[15,1,15,2],[33,1,33,2],[13,1,13,2],[126,1,126,2],[127,1,127,2],[128,1,128,2],[136,1,136,2],[49,1,49,2],[115,1,115,2],[80,1,80,2],[93,1,93,2],[94,1,94,2],[111,1,111,2],[114,1,114,2],[86,1,86,2],[105,1,105,2],[82,1,82,2],[99,1,99,2],[112,1,112,2]]}
["Quality Survey",null,null,null,null,"Quality Score",null,{"$f":"IF(K7=0,F535,\"Complete all responses in the Survey\")","v":"Complete all responses in the Survey"}]
["SQ04-0005 Rev 37"]
[null,null,{"$f":"IF(M7>0,M7 & \" Item(s) Will Require Follow Up\",\"\")","v":""}]
[null,null,{"$f":"IF(M7>0,\"See Highlighted Boxes\",\"\")","v":""}]
[]
[null,"1.2 Scope",null,{"$f":"IF(SUM(K7:K116)<>0,\"* Response Required\",\"\")","v":"* Response Required"},null,null,null,null,null,"Scoring","Data Entry Check","Shall Items","Shall Exceptions"]
[null,"Select supplier type",null,{"$f":"IF(OR(E7=\"\",E7=\"Select Supplier Type\"),\"*\",\"\")","v":"*"},"Select Supplier Type",null,null,null,null,{"$f":"IF(OR(E7=\"Calibration\",E7=\"Laboratory Services\",E7=\"Distributors\",E7=\"Audit Services / QMS Training\",E7=\"Final Electrical Testing\"),1,0)","v":0},{"$f":"SUM(K10:K137)","v":88},"ü",{"$f":"SUM(M10:M137)","v":0}]
[null,null,null,null,"Response","Comments",null,"Skyworks SQE Comments","Clear"]
[null,"3.0 Associated Documents",null,null,null,null,null,null,null,{"$f":"AVERAGE(J10:J10)","v":0}]
[{"$f":"IF(L10<>\"\",\"*\",\"\")","v":"*"},"Have you visited the Skyworks supplier portal at www.skyworksinc.com and signed up for automatic email notifications for document updates?",null,{"$f":"IF(OR(E10<>\"\",B10=\"Not applicable\"),\"\",\"*\")","v":"*"},null,null,null,null,null,{"$f":"IF(OR(B10=\"Not applicable\",E10=\"Yes\",I10=\"SWKS-SQE\"),1,0)","v":0},{"$f":"IF(D10=\"*\",1,0)","v":1},"ü",{"$f":"IF(OR(B10=\"Not applicable\",E10=\"Yes\", E10=\"\",AND(I10=\"SWKS-SQE\",H10<>\"\")),0,1)","v":0},{"$f":"IF(AND(I10=\"SWKS-SQE\",H10=\"\"),\"<-- Enter Skyworks SQE comments to clear flag\",\"\")","v":""}]
["","5.1 Corporate Policies and Objectives",null,null,null,null,null,null,null,{"$f":"AVERAGE(J12:J14)","v":0}]
[{"$f":"IF(L12<>\"\",\"*\",\"\")","v":"*"},"Have you read and understood and accept Skyworks' corporate policies and objectives as outlined in SQ02-0020 Supplier Quality Manual?",null,{"$f":"IF(OR(E12<>\"\",B12=\"Not applicable\"),\"\",\"*\")","v":"*"},null,null,null,null,null,{"$f":"IF(OR(B12=\"Not applicable\",E12=\"Yes\",I12=\"SWKS-SQE\"),1,0)","v":0},{"$f":"IF(D12=\"*\",1,0)","v":1},"ü",{"$f":"IF(OR(B12=\"Not applicable\",E12=\"Yes\", E12=\"\",AND(I12=\"SWKS-SQE\",H12<>\"\")),0,1)","v":0},{"$f":"IF(AND(I12=\"SWKS-SQE\",H12=\"\"),\"<-- Enter Skyworks SQE comments to clear flag\",\"\")","v":""}]
[{"$f":"IF(L13<>\"\",\"*\",\"\")","v":"*"},"Will you strictly maintain confidentiality in accordance with the supplier terms and condition of purchase outlined in SQ04-0019 General Terms and Conditions?",null,{"$f":"IF(OR(E13<>\"\",B13=\"Not applicable\"),\"\",\"*\")","v":"*"},null,null,null,null,null,{"$f":"IF(OR(B13=\"Not applicable\",E13=\"Yes\",I13=\"SWKS-SQE\"),1,0)","v":0},{"$f":"IF(D13=\"*\",1,0)","v":1},"ü",{"$f":"IF(OR(B13=\"Not applicable\",E13=\"Yes\", E13=\"\",AND(I13=\"SWKS-SQE\",H13<>\"\")),0,1)","v":0},{"$f":"IF(AND(I13=\"SWKS-SQE\",H13=\"\"),\"<-- Enter Skyworks SQE comments to clear flag\",\"\")","v":""}]
[{"$f":"IF(L14<>\"\",\"*\",\"\")","v":"*"},{"$f":"IF(OR($E$7=\"Audit Services / QMS Training\", $E$7=\"Calibration\"),\"Not Applicable\",\"Will you implement the requirements of this specification to your end suppliers?\")","v":"Will you implement the requirements of this specification to your end suppliers?"},null,{"$f":"IF(OR(E14<>\"\",B14=\"Not applicable\"),\"\",\"*\")","v":"*"},null,null,null,null,null,{"$f":"IF(OR(B14=\"Not applicable\",E14=\"Yes\",I14=\"SWKS-SQE\"),1,0)","v":0},1,"ü",{"$f":"IF(OR(B14=\"Not applicable\",E14=\"Yes\", E14=\"\",AND(I14=\"SWKS-SQE\",H14<>\"\")),0,1)","v":0},{"$f":"IF(AND(I14=\"SWKS-SQE\",H14=\"\"),\"<-- Enter Skyworks SQE comments to clear flag\",\"\")","v":""}]
["","5.3 Sustainability",null,null,null,null,null,null,null,{"$f":"AVERAGE(J16:J16)","v":0}]
["*",{"$f":"IF($E$7=\"Audit Services / QMS Training\",\"Not applicable\",\"Have you read, understood and comply with SQ03-0337 Skyworks Supplier Sustainability Specification?\")","v":"Have you read, understood and comply with SQ03-0337 Skyworks Supplier Sustainability Specification?"},null,{"$f":"IF(OR(E16<>\"\",B16=\"Not applicable\"),\"\",\"*\")","v":"*"},null,null,null,null,null,{"$f":"IF(OR(B16=\"Not applicable\",E16=\"Yes\",I16=\"SWKS-SQE\"),1,0)","v":0},{"$f":"IF(D16=\"*\",1,0)","v":1},"ü",{"$f":"IF(OR(B16=\"Not applicable\",E16=\"Yes\", E16=\"\",AND(I16=\"SWKS-SQE\",H16<>\"\")),0,1)","v":0},{"$f":"IF(AND(I16=\"SWKS-SQE\",H16=\"\"),\"<-- Enter Skyworks SQE comments to clear flag\",\"\")","v":""}]
["","5.5 Risk Management Policy",null,null,null,null,null,null,null,{"$f":"AVERAGE(J18:J19)","v":0}]
["*","Do you have an up-to-date, documented Risk Management Policy?",null,{"$f":"IF(OR(E18<>\"\",B18=\"Not applicable\"),\"\",\"*\")","v":"*"},null,null,null,null,null,{"$f":"IF(OR(B18=\"Not applicable\",E18=\"Yes\",I18=\"SWKS-SQE\"),1,0)","v":0},{"$f":"IF(D18=\"*\",1,0)","v":1},"ü",{"$f":"IF(OR(B18=\"Not applicable\",E18=\"Yes\", E18=\"\",AND(I18=\"SWKS-SQE\",H18<>\"\")),0,1)","v":0},{"$f":"IF(AND(I18=\"SWKS-SQE\",H18=\"\"),\"<-- Enter Skyworks SQE comments to clear flag\",\"\")","v":""}]
["*",{"$f":"IF(E18=\"No\",\"Do you have a plan to develop such a policy?\",\"Have you provided a copy of your policy to your Skyworks Supplier Quality representative?\")","v":"Have you provided a copy of your policy to your Skyworks Supplier Quality representative?"},null,{"$f":"IF(OR(E19<>\"\",B19=\"Not applicable\"),\"\",\"*\")","v":"*"},null,{"$f":"IF(AND(E18=\"Yes\",E19=\"No\"),\"Provide a copy of your policy along with this completed survey.\",IF(AND(E18=\"No\",E19=\"No\"),\"Failure to develop such a policy may preclude you from doing business with Skyworks!\",IF(AND(E18=\"No\",E19=\"Yes\"),\"\",IF(AND(E18=\"Yes\",E19=\"Yes\"),\"\",IF(OR(E18=\"\",E19=\"\"),\"\")))))","v":""},null,null,null,{"$f":"IF(OR(B19=\"Not applicable\",E19=\"Yes\",I19=\"SWKS-SQE\"),1,0)","v":0},{"$f":"IF(D19=\"*\",1,0)","v":1},"ü",{"$f":"IF(OR(B19=\"Not applicable\",E19=\"Yes\", E19=\"\",AND(I19=\"SWKS-SQE\",H19<>\"\")),0,1)","v":0},{"$f":"IF(AND(I19=\"SWKS-SQE\",H19=\"\"),\"<-- Enter Skyworks SQE comments to clear flag\",\"\")","v":""}]
["","5.6 Notification of Product Quality or Delivery Issues"]
["","5.6.1 Supplier Charge Back"]
["",null,null,null,null,null,null,null,null,{"$f":"AVERAGE(J23:J23)","v":0}]
["",{"$f":"IF(OR($E$7=\"calibration\",$E$7=\"Laboratory Services\",$E$7=\"Audit Services / QMS Training\"),\"Not Applicable\", \"The supplier understands that in the event the supplier causes a quality or delivery concern and there are costs incurred by Skyworks due a supplier not adhering to our requirements, Skyworks may charge back this cost to the supplier\")","v":"The supplier understands that in the event the supplier causes a quality or delivery concern and there are costs incurred by Skyworks due a supplier not adhering to our requirements, Skyworks may charge back this cost to the supplier"},null,{"$f":"IF(OR(E23<>\"\",B23=\"Not applicable\"),\"\",\"*\")","v":"*"},null,null,null,null,null,{"$f":"IF(OR(B23=\"Not applicable\",E23=\"Yes\",I23=\"SWKS-SQE\"),1,0)","v":0},{"$f":"IF(D23=\"*\",1,0)","v":1},null,{"$f":"IF(OR(B23=\"Not applicable\",E23=\"Yes\", E23=\"\",AND(I23=\"SWKS-SQE\",H23<>\"\")),0,1)","v":0},{"$f":"IF(AND(I23=\"SWKS-SQE\",H23=\"\"),\"<-- Enter Skyworks SQE comments to clear flag\",\"\")","v":""}]
["","5.7 Product Identification",null,null,null,null,null,null,null,{"$f":"AVERAGE(J25:J26)","v":0}]
["*",{"$f":"IF(OR($E$7=\"Calibration\",$E$7=\"Laboratory Services\",$E$7=\"Audit Services / QMS Training\"),\"Not applicable\",\"Do you have a system of manufacturing control used for the identification of products with regard to type, lot or serial number, and their status during all stages of production and test?\")","v":"Do you have a system of manufacturing control used for the identification of products with regard to type, lot or serial number, and their status during all stages of production and test?"},null,{"$f":"IF(OR(E25<>\"\",B25=\"Not applicable\"),\"\",\"*\")","v":"*"},null,null,null,null,null,{"$f":"IF(OR(B25=\"Not applicable\",E25=\"Yes\",I25=\"SWKS-SQE\"),1,0)","v":0},{"$f":"IF(D25=\"*\",1,0)","v":1},"ü",{"$f":"IF(OR(B25=\"Not applicable\",E25=\"Yes\", E25=\"\",AND(I25=\"SWKS-SQE\",H25<>\"\")),0,1)","v":0},{"$f":"IF(AND(I25=\"SWKS-SQE\",H25=\"\"),\"<-- Enter Skyworks SQE comments to clear flag\",\"\")","v":""}]
["*",{"$f":"IF(OR($E$7=\"Calibration\",$E$7=\"Laboratory Services\",$E$7=\"Distributors\",$E$7=\"Audit Services / QMS Training\"),\"Not applicable\",\"Are shipments containing finished products labeled in accordance with SQ03-0120 Skyworks Labeling Requirements?\")","v":"Are shipments containing finished products labeled in accordance with SQ03-0120 Skyworks Labeling Requirements?"},null,{"$f":"IF(OR(E26<>\"\",B26=\"Not applicable\"),\"\",\"*\")","v":"*"},null,null,null,null,null,{"$f":"IF(OR(B26=\"Not applicable\",E26=\"Yes\",I26=\"SWKS-SQE\"),1,0)","v":0},{"$f":"IF(D26=\"*\",1,0)","v":1},"ü",{"$f":"IF(OR(B26=\"Not applicable\",E26=\"Yes\", E26=\"\",AND(I26=\"SWKS-SQE\",H26<>\"\")),0,1)","v":0},{"$f":"IF(AND(I26=\"SWKS-SQE\",H26=\"\"),\"<-- Enter Skyworks SQE comments to clear flag\",\"\")","v":""}]
["","5.8 Product Traceability",null,null,null,null,null,null,null,{"$f":"AVERAGE(J28:J29)","v":0}]
["*",{"$f":"IF(OR($E$7=\"Calibration\",$E$7=\"Laboratory Services\",$E$7=\"Audit Services / QMS Training\"),\"Not applicable\",\"Do you have a system for ensuring finished product traceability back to the subassembly, component and raw materials?\")","v":"Do you have a system for ensuring finished product traceability back to the subassembly, component and raw materials?"},null,{"$f":"IF(OR(E28<>\"\",B28=\"Not applicable\"),\"\",\"*\")","v":"*"},null,null,null,null,null,{"$f":"IF(OR(B28=\"Not applicable\",E28=\"Yes\",I28=\"SWKS-SQE\"),1,0)","v":0},{"$f":"IF(D28=\"*\",1,0)","v":1},"ü",{"$f":"IF(OR(B28=\"Not applicable\",E28=\"Yes\", E28=\"\",AND(I28=\"SWKS-SQE\",H28<>\"\")),0,1)","v":0},{"$f":"IF(AND(I28=\"SWKS-SQE\",H28=\"\"),\"<-- Enter Skyworks SQE comments to clear flag\",\"\")","v":""}]
["*",{"$f":"IF(OR($E$7=\"Calibration\",$E$7=\"Laboratory Services\",$E$7=\"Audit Services / QMS Training\"),\"Not applicable\",\"Is traceability achieved by means of date code, lot and/or serial number?\")","v":"Is traceability achieved by means of date code, lot and/or serial number?"},null,{"$f":"IF(OR(E29<>\"\",B29=\"Not applicable\"),\"\",\"*\")","v":"*"},null,null,null,null,null,{"$f":"IF(OR(B29=\"Not applicable\",E29=\"Yes\",I29=\"SWKS-SQE\"),1,0)","v":0},{"$f":"IF(D29=\"*\",1,0)","v":1},"ü",{"$f":"IF(OR(B29=\"Not applicable\",E29=\"Yes\", E29=\"\",AND(I29=\"SWKS-SQE\",H29<>\"\")),0,1)","v":0},{"$f":"IF(AND(I29=\"SWKS-SQE\",H29=\"\"),\"<-- Enter Skyworks SQE comments to clear flag\",\"\")","v":""}]
["","5.9 Quality Plan",null,null,null,null,null,null,null,{"$f":"AVERAGE(J31,J36,J45,J61,J67,J69,J74,J76,J82,J85,J88,J93,J96)","v":0}]
["","5.9.1 Quality System",null,null,null,null,null,null,null,{"$f":"AVERAGE(J32:J35)","v":0}]
["*",{"$f":"IF(OR(E7=\"Calibration\",E7=\"Laboratory Services\"),\"Are you registered to ISO/IEC 17025?\",IF(OR(E7=\"Assembly\",E7=\"Final Electrical Testing\"),\"Are you registered to ISO 9001 and ANSI/ESD S.20.20 (or equivalent)?\",\"Are you registered to ISO 9001  (or equivalent)?\"))","v":"Are you registered to ISO 9001  (or equivalent)?"},null,{"$f":"IF(OR(E32<>\"\",B32=\"Not applicable\"),\"\",\"*\")","v":"*"},null,null,null,null,null,{"$f":"IF(OR(B32=\"Not applicable\",E32=\"Yes\",I32=\"SWKS-SQE\"),1,0)","v":0},{"$f":"IF(D32=\"*\",1,0)","v":1},"ü",{"$f":"IF(OR(B32=\"Not applicable\",E32=\"Yes\", E32=\"\",AND(I32=\"SWKS-SQE\",H32<>\"\")),0,1)","v":0},{"$f":"IF(AND(I32=\"SWKS-SQE\",H32=\"\"),\"<-- Enter Skyworks SQE comments to clear flag\",\"\")","v":""}]
[{"$f":"IF(L33<>\"\",\"*\",\"\")","v":"*"},{"$f":"IF(E32=\"No\",\"Do you have a plan in place to become registered?\",\"Have you attached a copy of your certificate(s) that shows certification body's accreditation mark as part of this Survey?\")","v":"Have you attached a copy of your certificate(s) that shows certification body's accreditation mark as part of this Survey?"},null,{"$f":"IF(OR(E33<>\"\",B33=\"Not applicable\"),\"\",\"*\")","v":"*"},null,{"$f":"IF(AND(E32=\"Yes\",E33=\"No\"),\"Attach your certificate at Supplier Qualification Profile Tab.\",IF(AND(E32=\"No\",E33=\"No\"),\"Failure to become certified may preclude you from doing business with Skyworks!\",IF(AND(E32=\"No\",E33=\"Yes\"),\"Provide a copy of your certification plan along with this completed survey. \",IF(AND(E32=\"Yes\",E33=\"Yes\"),\"\",IF(OR(E32=\"\",E33=\"\"),\"\")))))","v":""},null,null,null,{"$f":"IF(OR(B34=\"Not applicable\",E33=\"Yes\",I33=\"SWKS-SQE\"),1,0)","v":0},{"$f":"IF(D33=\"*\",1,0)","v":1},"ü",{"$f":"IF(OR(B34=\"Not applicable\",E33=\"Yes\", E33=\"\",AND(I33=\"SWKS-SQE\",H33<>\"\")),0,1)","v":0},{"$f":"IF(AND(I33=\"SWKS-SQE\",H33=\"\"),\"<-- Enter Skyworks SQE comments to clear flag\",\"\")","v":""}]
["*",{"$f":"IF(OR($E$7=\"QMS Training\",$E$7=\"Calibration\",$E$7=\"Laboratory Services\",$E$7=\"Audit Services / QMS Training\",$E$7=\"Distributors\"),\"Not applicable\",\"Are you registered to IATF 16949?\")","v":"Are you registered to IATF 16949?"},null,"*",null,null,null,null,null,{"$f":"IF(OR(B34=\"Not applicable\",E34=\"Yes\",I34=\"SWKS-SQE\"),1,0)","v":0},{"$f":"IF(D34=\"*\",1,0)","v":1},"ü",{"$f":"IF(OR(B34=\"Not applicable\",E34=\"Yes\", E34=\"\",AND(I34=\"SWKS-SQE\",H34<>\"\")),0,1)","v":0},{"$f":"IF(AND(I34=\"SWKS-SQE\",H34=\"\"),\"<-- Enter Skyworks SQE comments to clear flag\",\"\")","v":""}]
["*",{"$f":"IF(OR($E$7=\"QMS Training\",$E$7=\"Calibration\",$E$7=\"Laboratory Services\",$E$7=\"Audit Services / QMS Training\",$E$7=\"Distributors\"),\"Not Applicable\",IF(E34=\"No\",\"Do you have a plan in place to become IATF16949 registered?\",\"Have you provided a copy of your IATF 16949 certificate(s) that shows certification body's accreditation mark as part of this Survey?\"))","v":"Have you provided a copy of your IATF 16949 certificate(s) that shows certification body's accreditation mark as part of this Survey?"},null,"*",null,{"$f":"IF(AND(E34=\"Yes\",E35=\"No\"),\"Attach your certificate at Supplier Qualification Profile Tab.\",IF(AND(E34=\"No\",E35=\"No\"),\"Failure to become certified may preclude you from doing business with Skyworks!\",IF(AND(E34=\"No\",E35=\"Yes\"),\"Provide a copy of your certification plan along with this completed survey. \",IF(AND(E34=\"Yes\",E35=\"Yes\"),\"\",IF(OR(E34=\"\",E35=\"\"),\"\")))))","v":""},null,null,null,0,1,"ü",0]
[{"$f":"IF(L36<>\"\",\"*\",\"\")","v":""},"5.9.1.1 Internal Laboratory Requirements",null,null,null,null,null,null,null,{"$f":"AVERAGE(J37:J44)","v":0}]
["*",{"$f":"IF(OR(AND($E$7=\"Calibration\",$E$32=\"no\"),$E$7=\"Select Supplier Type\"),\"Does your company have a defined scope of internal laboratory requirements related to the calibration services that will be providing to Skyworks that includes its capability to perform the required service?\",\"Not applicable\")","v":"Does your company have a defined scope of internal laboratory requirements related to the calibration services that will be providing to Skyworks that includes its capability to perform the required service?"},null,"*",null,null,null,null,null,{"$f":"IF(OR(B37=\"Not applicable\",E37=\"Yes\",I37=\"SWKS-SQE\"),1,0)","v":0},{"$f":"IF(D37=\"*\",1,0)","v":1},"ü",{"$f":"IF(OR(B37=\"Not applicable\",E37=\"Yes\", E37=\"\",AND(I37=\"SWKS-SQE\",H37<>\"\")),0,1)","v":0}]
["*",{"$f":"IF(OR(AND($E$7=\"Calibration\",$E$32=\"no\"),$E$7=\"Select Supplier Type\"),\"Is your Internal Laboratory Scope documented within your QMS Document Control system?\",\"Not applicable\")","v":"Is your Internal Laboratory Scope documented within your QMS Document Control system?"},null,"*",null,null,null,null,null,0,1,"ü",0]
["*",{"$f":"IF(OR(AND($E$7=\"Calibration\",$E$32=\"no\"),$E$7=\"Select Supplier Type\"),\"Does your company specify and implement the adequacy of your laboratory's technical procedures?\",\"Not applicable\")","v":"Does your company specify and implement the adequacy of your laboratory's technical procedures?"},null,"*",null,null,null,null,null,0,1,"ü",0]
["*",{"$f":"IF(OR(AND($E$7=\"Calibration\",$E$32=\"no\"),$E$7=\"Select Supplier Type\"),\"Does your company assess the requirement for the calibration for measurement equipment?\",\"Not applicable\")","v":"Does your company assess the requirement for the calibration for measurement equipment?"},null,"*",null,null,null,null,null,0,1,"ü",0]
{"$rows_left_out":496}
{"sheet":"Quality Survey Score","index":3,"n_rows":1,"n_cols":17,"rows_kept":1,"cut":false,"hidden":false,"merged":[]}
["Quality Score",null,null,{"$f":"IF('Quality Survey'!K7=0,'Quality Survey'!F535,\"Complete all responses in the Survey\")","v":"Complete all responses in the Survey"},null,null,null,null,null,null,null,null,null,null,null,null,{"$f":"'Supplier Qualification Profile'!C7","v":0}]

{"sheet":"Sustainability Survey","index":4,"n_rows":15,"n_cols":11,"rows_kept":15,"cut":false,"hidden":false,"merged":[[14,0,14,3]]}
["Sustainability Survey",null,null,null,null,null,null,{"$f":"IF(SUM(F7:F12)=0,\"Sustainability Score: \" & IF('Quality Survey'!E16=\"No\",\"High Risk\",IF(E5=1,\"Low Risk\",IF(E5=2,\"Medium Risk\",IF(AND(E5=3,G5>0),\"High Risk\",\"\")))),\"\")","v":""},null,"Ranking Guidelines"]
["SQ04-0005 Rev 37",null,null,{"$f":"IF(G5>0,G5 & \" Item(s) Will Require Follow Up\",\"\")","v":""},null,null,null,null,null,"Green","Yes"]
[null,null,null,{"$f":"IF(G5>0,\"See Highlighted Boxes\",\"\")","v":""},null,null,null,null,null,"Red","No"]
[null,null,null,{"$f":"IF('Quality Survey'!E16=\"No\",\"Response for 5.3 Sustainability from Quality survey tab is 'No'\",\"\")","v":""}]
[null,{"$f":"IF(SUM(F7:F12)<>0,\"* Response Required\",\"\")","v":"* Response Required"},null,null,{"$f":"MAX(E7:E12)","v":0},null,{"$f":"SUM(G7:G12)","v":0}]
[null,null,"Ranking","Comments","Score","Cell Check","Exceptions"]
["Company has received a copy of the SQ03-0337 Supplier Sustainability Specification, and agrees to conform to its applicable requirements.",{"$f":"IF(C7=\"\",\"*\",\"\")","v":"*"},null,{"$f":"IF(C7=\"No\", \"Add a Comment\",\"\")","v":""},{"$f":"IF(C7=\"Yes\",1,IF(C7=\"No\",3,0))","v":0},{"$f":"IF(C7=\"\",1,0)","v":1},{"$f":"IF(C7<>\"No\",0,1)","v":0}]
["Company commits to compliance with all applicable legal and regulatory requirements.",{"$f":"IF(C8=\"\",\"*\",\"\")","v":"*"},null,{"$f":"IF(C8=\"No\", \"Add a Comment\",\"\")","v":""},{"$f":"IF(C8=\"Yes\",1,IF(C8=\"No\",3,0))","v":0},{"$f":"IF(C8=\"\",1,0)","v":1},{"$f":"IF(C8<>\"No\",0,1)","v":0}]
["Company commits to supporting the RBA Code of Conduct and to maintaining sustainability programs in alignment to them. ",{"$f":"IF(C9=\"\",\"*\",\"\")","v":"*"},null,{"$f":"IF(C9=\"No\", \"Add a Comment\",\"\")","v":""},0,{"$f":"IF(C9=\"\",1,0)","v":1},{"$f":"IF(C9<>\"No\",0,1)","v":0}]
["Company agrees to promote the RBA Code of Conduct to its own suppliers.",{"$f":"IF(C10=\"\",\"*\",\"\")","v":"*"},null,"",0,{"$f":"IF(C10=\"\",1,0)","v":1},{"$f":"IF(C10<>\"No\",0,1)","v":0}]
["Level 1 Supplier Only \n(Raw Material)"]
["Company has received a copy of the SQ03-0132  Green Procurement Supplier Specification and agrees to conform to applicable requirements.",{"$f":"IF(C12=\"\",\"*\",\"\")","v":"*"},null,{"$f":"IF(OR(C12=\"No\",C12=\"NA\"),\"Add a Comment\",IF(C12=\"Yes\",\"\",IF(C12=\"\",\"\")))","v":""},0,{"$f":"IF(C12=\"\",1,0)","v":1},{"$f":"IF(C12<>\"No\",0,1)","v":0}]
[]
[]
["Note:  You can find the Link for these Documents on first Tab of this file \" Supplier Survey Instructions\""]